{"text_format":"1","workbook":"xlsx","n_sheets":5,"sheets":["Data","Limits","Sheet3","Sheet4","Display"],"not_rendered":{"charts":2,"images":5,"macros":1,"external_links":0,"defined_names":18,"comments":0,"pivot_tables":0},"unopened":[],"bounds":{"document_bytes":16777216,"sheet_cells":100000,"rows_first":2000,"rows_last":500,"rows_between":2000,"halvings":0,"cell_chars":16384,"cell_head_chars":4096},"cells_cut":0,"cells_raw":0,"read":"whole","date_system":"1900"}

{"sheet":"Data","index":0,"n_rows":126,"n_cols":27,"rows_kept":126,"cut":false,"hidden":false,"merged":[]}
["RANK","Country","CountryCode","Region","Overall","EnoughToEat","Affordability","FoodQuality","DiabetesObesity","Rank1","Rank2","Rank3","Rank4","Rank5","EqRank1","EqRank2","EqRank3","EqRank4","EqRank5",null,null,null,"Rank1","Rank2","Rank3","Rank4","Rank5"]
[51,"Tunisia","TUN","Africa",22,3.5000000000000004,25,28.5,31,53,47,51,69,93,{"$f":"_xlfn.RANK.EQ(Table1[[#This Row],[Overall]],Table1[Overall],1)","v":51},{"$f":"_xlfn.RANK.EQ(Table1[[#This Row],[EnoughToEat]],Table1[EnoughToEat],1)","v":46},{"$f":"_xlfn.RANK.EQ(Table1[[#This Row],[Affordability]],Table1[Affordability],1)","v":51},{"$f":"_xlfn.RANK.EQ(Table1[[#This Row],[FoodQuality]],Table1[FoodQuality],1)","v":68},{"$f":"_xlfn.RANK.EQ(Table1[[#This Row],[DiabetesObesity]],Table1[DiabetesObesity],1)","v":91},null,null,null,1,1,2,3,48]
[57,"Cape Verde","CPV","Africa",23,17.5,21.5,28,26,59,75,40,66,73,{"$f":"_xlfn.RANK.EQ(Table1[[#This Row],[Overall]],Table1[Overall],1)","v":57},{"$f":"_xlfn.RANK.EQ(Table1[[#This Row],[EnoughToEat]],Table1[EnoughToEat],1)","v":75},{"$f":"_xlfn.RANK.EQ(Table1[[#This Row],[Affordability]],Table1[Affordability],1)","v":39},{"$f":"_xlfn.RANK.EQ(Table1[[#This Row],[FoodQuality]],Table1[FoodQuality],1)","v":66},{"$f":"_xlfn.RANK.EQ(Table1[[#This Row],[DiabetesObesity]],Table1[DiabetesObesity],1)","v":73},null,null,null,2,1,4,15,51]
[57,"Mauritius","MRI","Africa",23,15.499999999999998,29.5,20.5,26.5,60,72,67,48,75,{"$f":"_xlfn.RANK.EQ(Table1[[#This Row],[Overall]],Table1[Overall],1)","v":57},{"$f":"_xlfn.RANK.EQ(Table1[[#This Row],[EnoughToEat]],Table1[EnoughToEat],1)","v":72},{"$f":"_xlfn.RANK.EQ(Table1[[#This Row],[Affordability]],Table1[Affordability],1)","v":66},{"$f":"_xlfn.RANK.EQ(Table1[[#This Row],[FoodQuality]],Table1[FoodQuality],1)","v":47},{"$f":"_xlfn.RANK.EQ(Table1[[#This Row],[DiabetesObesity]],Table1[DiabetesObesity],1)","v":74},null,null,null,2,1,3,2,57]
[65,"Morocco","MAR","Africa",24,4.5,23,44.5,24,66,53,46,89,67,{"$f":"_xlfn.RANK.EQ(Table1[[#This Row],[Overall]],Table1[Overall],1)","v":65},{"$f":"_xlfn.RANK.EQ(Table1[[#This Row],[EnoughToEat]],Table1[EnoughToEat],1)","v":52},{"$f":"_xlfn.RANK.EQ(Table1[[#This Row],[Affordability]],Table1[Affordability],1)","v":46},{"$f":"_xlfn.RANK.EQ(Table1[[#This Row],[FoodQuality]],Table1[FoodQuality],1)","v":89},{"$f":"_xlfn.RANK.EQ(Table1[[#This Row],[DiabetesObesity]],Table1[DiabetesObesity],1)","v":65},null,null,null,4,1,26,6,55]
[67,"South Africa","RSA","Africa",25,9.5,22.5,32.5,36,70,65,44,74,117,{"$f":"_xlfn.RANK.EQ(Table1[[#This Row],[Overall]],Table1[Overall],1)","v":67},{"$f":"_xlfn.RANK.EQ(Table1[[#This Row],[EnoughToEat]],Table1[EnoughToEat],1)","v":65},{"$f":"_xlfn.RANK.EQ(Table1[[#This Row],[Affordability]],Table1[Affordability],1)","v":42},{"$f":"_xlfn.RANK.EQ(Table1[[#This Row],[FoodQuality]],Table1[FoodQuality],1)","v":74},{"$f":"_xlfn.RANK.EQ(Table1[[#This Row],[DiabetesObesity]],Table1[DiabetesObesity],1)","v":115},null,null,null,4,1,15,10,61]
[71,"Botswana","BOT","Africa",26,29.5,35.5,24,14.5,72,91,85,62,41,{"$f":"_xlfn.RANK.EQ(Table1[[#This Row],[Overall]],Table1[Overall],1)","v":71},{"$f":"_xlfn.RANK.EQ(Table1[[#This Row],[EnoughToEat]],Table1[EnoughToEat],1)","v":91},{"$f":"_xlfn.RANK.EQ(Table1[[#This Row],[Affordability]],Table1[Affordability],1)","v":84},{"$f":"_xlfn.RANK.EQ(Table1[[#This Row],[FoodQuality]],Table1[FoodQuality],1)","v":61},{"$f":"_xlfn.RANK.EQ(Table1[[#This Row],[DiabetesObesity]],Table1[DiabetesObesity],1)","v":41},null,null,null,4,1,13,10,62]
[71,"Ghana","GHA","Africa",26,16,29.5,45,15,73,73,68,90,46,{"$f":"_xlfn.RANK.EQ(Table1[[#This Row],[Overall]],Table1[Overall],1)","v":71},{"$f":"_xlfn.RANK.EQ(Table1[[#This Row],[EnoughToEat]],Table1[EnoughToEat],1)","v":73},{"$f":"_xlfn.RANK.EQ(Table1[[#This Row],[Affordability]],Table1[Affordability],1)","v":66},{"$f":"_xlfn.RANK.EQ(Table1[[#This Row],[FoodQuality]],Table1[FoodQuality],1)","v":90},{"$f":"_xlfn.RANK.EQ(Table1[[#This Row],[DiabetesObesity]],Table1[DiabetesObesity],1)","v":44},null,null,null,4,1,7,6,76]
[77,"Sao Tome and Principe","STP","Africa",27,18.5,52,22.5,15,77,78,117,56,44,{"$f":"_xlfn.RANK.EQ(Table1[[#This Row],[Overall]],Table1[Overall],1)","v":77},{"$f":"_xlfn.RANK.EQ(Table1[[#This Row],[EnoughToEat]],Table1[EnoughToEat],1)","v":76},{"$f":"_xlfn.RANK.EQ(Table1[[#This Row],[Affordability]],Table1[Affordability],1)","v":117},{"$f":"_xlfn.RANK.EQ(Table1[[#This Row],[FoodQuality]],Table1[FoodQuality],1)","v":54},{"$f":"_xlfn.RANK.EQ(Table1[[#This Row],[DiabetesObesity]],Table1[DiabetesObesity],1)","v":44},null,null,null,8,1,11,27,65]
[77,"Gabon","GAB","Africa",27,11,45,33.5,18.5,78,69,108,77,52,{"$f":"_xlfn.RANK.EQ(Table1[[#This Row],[Overall]],Table1[Overall],1)","v":77},{"$f":"_xlfn.RANK.EQ(Table1[[#This Row],[EnoughToEat]],Table1[EnoughToEat],1)","v":68},{"$f":"_xlfn.RANK.EQ(Table1[[#This Row],[Affordability]],Table1[Affordability],1)","v":108},{"$f":"_xlfn.RANK.EQ(Table1[[#This Row],[FoodQuality]],Table1[FoodQuality],1)","v":75},{"$f":"_xlfn.RANK.EQ(Table1[[#This Row],[DiabetesObesity]],Table1[DiabetesObesity],1)","v":52},null,null,null,8,1,17,23,68]
{"$rows_left_out":117}
{"sheet":"Limits","index":1,"n_rows":126,"n_cols":15,"rows_kept":126,"cut":false,"hidden":false,"merged":[]}
[null,"Section","Group","From >=","< To",null,null,null,"- Highlight a country -"]
["Overall",1,1,5,10,null,null,null,"Albania",null,1,null,null,null,"http://www.oxfam.org.uk/what-we-do/good-enough-to-eat"]
["Overall",1,2,10,15,null,null,null,"Angola",null,{"$f":"IF(HILITE_COUNTRY>1,INDEX(SELECT_COUNTRY,HILITE_COUNTRY),\"\")","v":""}]
["Overall",1,3,15,20,null,null,null,"Argentina",null,{"$f":"IFERROR(VLOOKUP(K3,Table1[[#All],[Country]:[CountryCode]],2,FALSE),\"\")","v":""}]
["Overall",1,4,20,25,null,null,null,"Armenia",null,{"$f":"INDEX(Table1[Region],MATCH(K4,Table1[CountryCode],0))","v":{"$error":"#N/A"}}]
["Overall",1,5,25,30,null,null,null,"Australia"]
["Overall",1,6,30,35,null,null,null,"Austria",null,"Dataset",1]
["Overall",1,7,35,40,null,null,null,"Azerbaijan",null,"Previous",1]
["Overall",1,8,40,45,null,null,null,"Bangladesh",null,"Increment",100]
["Overall",1,9,45,50,null,null,null,"Belarus"]
{"$rows_left_out":117}
{"sheet":"Sheet3","index":2,"n_rows":126,"n_cols":97,"rows_kept":126,"cut":false,"hidden":false,"merged":[]}
[null,null,"Africa","Asia","Australasia","Europe","North America","South America","Divider","DividerX","Hilite","Ypos",null,null,"Country","CountryCode","Region",null,null,null,null,null,null,"Africa","Asia","Australasia","Europe","North America","South America","Divider","DividerX",null,null,null,"Africa","Asia","Australasia","Europe","North America","South America","Divider","DividerX",null,null,null,"Africa","Asia","Australasia","Europe","North America","South America","Divider","DividerX",null,null,null,"Africa","Asia","Australasia","Europe","North America","South America","Divider","DividerX",null,null,null,"Africa","Asia","Australasia","Europe","North America","South America","Divider","DividerX",null,null,null,"Africa","Asia","Australasia","Europe","North America","South America","Divider","DividerX",null,null,null,"Africa","Asia","Australasia","Europe","North America","South America","Divider","DividerX"]
["TUN",{"$f":"OLD_DATASET+((NEW_DATASET-OLD_DATASET)*(INCREMENT/100))","v":11},5,{"$error":"#N/A"},{"$error":"#N/A"},{"$error":"#N/A"},{"$error":"#N/A"},{"$error":"#N/A"},10.5,2,{"$f":"INDEX(B2:B126,MATCH(HILITE_CODE,Sheet3!A2:A126,0))","v":{"$error":"#N/A"}},{"$f":"INDEX(C2:H126,MATCH(HILITE_CODE,Sheet3!A2:A126,0),MATCH(HILITE_REGION,C1:H1,0))","v":{"$error":"#N/A"}},{"$f":"HILITE_CODE","v":""},null,"Albania","ALB","Asia",null,null,null,null,"TUN",11,5,{"$f":"NA()","v":{"$error":"#N/A"}},{"$f":"NA()","v":{"$error":"#N/A"}},{"$f":"NA()","v":{"$error":"#N/A"}},{"$f":"NA()","v":{"$error":"#N/A"}},{"$f":"NA()","v":{"$error":"#N/A"}},10.5,2,null,"TUN",2,8,{"$f":"NA()","v":{"$error":"#N/A"}},{"$f":"NA()","v":{"$error":"#N/A"}},{"$f":"NA()","v":{"$error":"#N/A"}},{"$f":"NA()","v":{"$error":"#N/A"}},{"$f":"NA()","v":{"$error":"#N/A"}},10.5,8,null,"TUN",8,7,{"$f":"NA()","v":{"$error":"#N/A"}},{"$f":"NA()","v":{"$error":"#N/A"}},{"$f":"NA()","v":{"$error":"#N/A"}},{"$f":"NA()","v":{"$error":"#N/A"}},{"$f":"NA()","v":{"$error":"#N/A"}},10.5,2,null,"TUN",8,1,{"$f":"NA()","v":{"$error":"#N/A"}},{"$f":"NA()","v":{"$error":"#N/A"}},{"$f":"NA()","v":{"$error":"#N/A"}},{"$f":"NA()","v":{"$error":"#N/A"}},{"$f":"NA()","v":{"$error":"#N/A"}},10.5,4,null,"TUN",17,8,{"$f":"NA()","v":{"$error":"#N/A"}},{"$f":"NA()","v":{"$error":"#N/A"}},{"$f":"NA()","v":{"$error":"#N/A"}},{"$f":"NA()","v":{"$error":"#N/A"}},{"$f":"NA()","v":{"$error":"#N/A"}},10.5,4,null,"TUN",{"$f":"CHOOSE(USE_DATASET,DATASET_1,DATASET_2,DATASET_3,DATASET_4,DATASET_5)","v":11},5,{"$error":"#N/A"},{"$error":"#N/A"},{"$error":"#N/A"},{"$error":"#N/A"},{"$error":"#N/A"},10.5,2,null,"TUN",{"$f":"CHOOSE(PREV_DATASET,DATASET_1,DATASET_2,DATASET_3,DATASET_4,DATASET_5)","v":11},5,{"$error":"#N/A"},{"$error":"#N/A"},{"$error":"#N/A"},{"$error":"#N/A"},{"$error":"#N/A"},10.5,2]
["CPV",10,8,{"$error":"#N/A"},{"$error":"#N/A"},{"$error":"#N/A"},{"$error":"#N/A"},{"$error":"#N/A"},10.5,6,null,null,null,null,"Angola","ANG","Africa",null,null,null,null,"CPV",10,8,{"$f":"NA()","v":{"$error":"#N/A"}},{"$f":"NA()","v":{"$error":"#N/A"}},{"$f":"NA()","v":{"$error":"#N/A"}},{"$f":"NA()","v":{"$error":"#N/A"}},{"$f":"NA()","v":{"$error":"#N/A"}},10.5,6,null,"CPV",9,4,{"$f":"NA()","v":{"$error":"#N/A"}},{"$f":"NA()","v":{"$error":"#N/A"}},{"$f":"NA()","v":{"$error":"#N/A"}},{"$f":"NA()","v":{"$error":"#N/A"}},{"$f":"NA()","v":{"$error":"#N/A"}},10.5,11,null,"CPV",10,2,{"$f":"NA()","v":{"$error":"#N/A"}},{"$f":"NA()","v":{"$error":"#N/A"}},{"$f":"NA()","v":{"$error":"#N/A"}},{"$f":"NA()","v":{"$error":"#N/A"}},{"$f":"NA()","v":{"$error":"#N/A"}},10.5,6,null,"CPV",8,4,{"$f":"NA()","v":{"$error":"#N/A"}},{"$f":"NA()","v":{"$error":"#N/A"}},{"$f":"NA()","v":{"$error":"#N/A"}},{"$f":"NA()","v":{"$error":"#N/A"}},{"$f":"NA()","v":{"$error":"#N/A"}},10.5,7,null,"CPV",11,4,{"$f":"NA()","v":{"$error":"#N/A"}},{"$f":"NA()","v":{"$error":"#N/A"}},{"$f":"NA()","v":{"$error":"#N/A"}},{"$f":"NA()","v":{"$error":"#N/A"}},{"$f":"NA()","v":{"$error":"#N/A"}},10.5,9,null,"CPV",10,8,{"$error":"#N/A"},{"$error":"#N/A"},{"$error":"#N/A"},{"$error":"#N/A"},{"$error":"#N/A"},10.5,6,null,"CPV",10,8,{"$error":"#N/A"},{"$error":"#N/A"},{"$error":"#N/A"},{"$error":"#N/A"},{"$error":"#N/A"},10.5,6]
["MRI",10,7,{"$error":"#N/A"},{"$error":"#N/A"},{"$error":"#N/A"},{"$error":"#N/A"},{"$error":"#N/A"},10.5,9,null,null,null,null,"Argentina","ARG","South America",null,null,null,null,"MRI",10,7,{"$f":"NA()","v":{"$error":"#N/A"}},{"$f":"NA()","v":{"$error":"#N/A"}},{"$f":"NA()","v":{"$error":"#N/A"}},{"$f":"NA()","v":{"$error":"#N/A"}},{"$f":"NA()","v":{"$error":"#N/A"}},10.5,9,null,"MRI",9,7,{"$f":"NA()","v":{"$error":"#N/A"}},{"$f":"NA()","v":{"$error":"#N/A"}},{"$f":"NA()","v":{"$error":"#N/A"}},{"$f":"NA()","v":{"$error":"#N/A"}},{"$f":"NA()","v":{"$error":"#N/A"}},10.5,14,null,"MRI",14,9,{"$f":"NA()","v":{"$error":"#N/A"}},{"$f":"NA()","v":{"$error":"#N/A"}},{"$f":"NA()","v":{"$error":"#N/A"}},{"$f":"NA()","v":{"$error":"#N/A"}},{"$f":"NA()","v":{"$error":"#N/A"}},10.5,11,null,"MRI",10,6,{"$f":"NA()","v":{"$error":"#N/A"}},{"$f":"NA()","v":{"$error":"#N/A"}},{"$f":"NA()","v":{"$error":"#N/A"}},{"$f":"NA()","v":{"$error":"#N/A"}},{"$f":"NA()","v":{"$error":"#N/A"}},10.5,11,null,"MRI",11,2,{"$f":"NA()","v":{"$error":"#N/A"}},{"$f":"NA()","v":{"$error":"#N/A"}},{"$f":"NA()","v":{"$error":"#N/A"}},{"$f":"NA()","v":{"$error":"#N/A"}},{"$f":"NA()","v":{"$error":"#N/A"}},10.5,14,null,"MRI",10,7,{"$error":"#N/A"},{"$error":"#N/A"},{"$error":"#N/A"},{"$error":"#N/A"},{"$error":"#N/A"},10.5,9,null,"MRI",10,7,{"$error":"#N/A"},{"$error":"#N/A"},{"$error":"#N/A"},{"$error":"#N/A"},{"$error":"#N/A"},10.5,9]
["MAR",10,1,{"$error":"#N/A"},{"$error":"#N/A"},{"$error":"#N/A"},{"$error":"#N/A"},{"$error":"#N/A"},10.5,13,null,null,null,null,"Armenia","ARM","Europe",null,null,null,null,"MAR",10,1,{"$f":"NA()","v":{"$error":"#N/A"}},{"$f":"NA()","v":{"$error":"#N/A"}},{"$f":"NA()","v":{"$error":"#N/A"}},{"$f":"NA()","v":{"$error":"#N/A"}},{"$f":"NA()","v":{"$error":"#N/A"}},10.5,13,null,"MAR",2,2,{"$f":"NA()","v":{"$error":"#N/A"}},{"$f":"NA()","v":{"$error":"#N/A"}},{"$f":"NA()","v":{"$error":"#N/A"}},{"$f":"NA()","v":{"$error":"#N/A"}},{"$f":"NA()","v":{"$error":"#N/A"}},10.5,17,null,"MAR",9,4,{"$f":"NA()","v":{"$error":"#N/A"}},{"$f":"NA()","v":{"$error":"#N/A"}},{"$f":"NA()","v":{"$error":"#N/A"}},{"$f":"NA()","v":{"$error":"#N/A"}},{"$f":"NA()","v":{"$error":"#N/A"}},10.5,15,null,"MAR",16,1,{"$f":"NA()","v":{"$error":"#N/A"}},{"$f":"NA()","v":{"$error":"#N/A"}},{"$f":"NA()","v":{"$error":"#N/A"}},{"$f":"NA()","v":{"$error":"#N/A"}},{"$f":"NA()","v":{"$error":"#N/A"}},10.5,14,null,"MAR",12,1,{"$f":"NA()","v":{"$error":"#N/A"}},{"$f":"NA()","v":{"$error":"#N/A"}},{"$f":"NA()","v":{"$error":"#N/A"}},{"$f":"NA()","v":{"$error":"#N/A"}},{"$f":"NA()","v":{"$error":"#N/A"}},10.5,19,null,"MAR",10,1,{"$error":"#N/A"},{"$error":"#N/A"},{"$error":"#N/A"},{"$error":"#N/A"},{"$error":"#N/A"},10.5,13,null,"MAR",10,1,{"$error":"#N/A"},{"$error":"#N/A"},{"$error":"#N/A"},{"$error":"#N/A"},{"$error":"#N/A"},10.5,13]
["RSA",15,6,{"$error":"#N/A"},{"$error":"#N/A"},{"$error":"#N/A"},{"$error":"#N/A"},{"$error":"#N/A"},10.5,16,null,null,null,null,"Australia","AUS","Australasia",null,null,null,null,"RSA",15,6,{"$f":"NA()","v":{"$error":"#N/A"}},{"$f":"NA()","v":{"$error":"#N/A"}},{"$f":"NA()","v":{"$error":"#N/A"}},{"$f":"NA()","v":{"$error":"#N/A"}},{"$f":"NA()","v":{"$error":"#N/A"}},10.5,16,null,"RSA",10,7,{"$f":"NA()","v":{"$error":"#N/A"}},{"$f":"NA()","v":{"$error":"#N/A"}},{"$f":"NA()","v":{"$error":"#N/A"}},{"$f":"NA()","v":{"$error":"#N/A"}},{"$f":"NA()","v":{"$error":"#N/A"}},10.5,19,null,"RSA",9,6,{"$f":"NA()","v":{"$error":"#N/A"}},{"$f":"NA()","v":{"$error":"#N/A"}},{"$f":"NA()","v":{"$error":"#N/A"}},{"$f":"NA()","v":{"$error":"#N/A"}},{"$f":"NA()","v":{"$error":"#N/A"}},10.5,18,null,"RSA",13,3,{"$f":"NA()","v":{"$error":"#N/A"}},{"$f":"NA()","v":{"$error":"#N/A"}},{"$f":"NA()","v":{"$error":"#N/A"}},{"$f":"NA()","v":{"$error":"#N/A"}},{"$f":"NA()","v":{"$error":"#N/A"}},10.5,17,null,"RSA",15,2,{"$f":"NA()","v":{"$error":"#N/A"}},{"$f":"NA()","v":{"$error":"#N/A"}},{"$f":"NA()","v":{"$error":"#N/A"}},{"$f":"NA()","v":{"$error":"#N/A"}},{"$f":"NA()","v":{"$error":"#N/A"}},10.5,21,null,"RSA",15,6,{"$error":"#N/A"},{"$error":"#N/A"},{"$error":"#N/A"},{"$error":"#N/A"},{"$error":"#N/A"},10.5,16,null,"RSA",15,6,{"$error":"#N/A"},{"$error":"#N/A"},{"$error":"#N/A"},{"$error":"#N/A"},{"$error":"#N/A"},10.5,16]
["BOT",15,4,{"$error":"#N/A"},{"$error":"#N/A"},{"$error":"#N/A"},{"$error":"#N/A"},{"$error":"#N/A"},10.5,19,null,null,null,null,"Austria","AUT","Europe",null,null,null,null,"BOT",15,4,{"$f":"NA()","v":{"$error":"#N/A"}},{"$f":"NA()","v":{"$error":"#N/A"}},{"$f":"NA()","v":{"$error":"#N/A"}},{"$f":"NA()","v":{"$error":"#N/A"}},{"$f":"NA()","v":{"$error":"#N/A"}},10.5,19,null,"BOT",16,7,{"$f":"NA()","v":{"$error":"#N/A"}},{"$f":"NA()","v":{"$error":"#N/A"}},{"$f":"NA()","v":{"$error":"#N/A"}},{"$f":"NA()","v":{"$error":"#N/A"}},{"$f":"NA()","v":{"$error":"#N/A"}},10.5,21,null,"BOT",13,1,{"$f":"NA()","v":{"$error":"#N/A"}},{"$f":"NA()","v":{"$error":"#N/A"}},{"$f":"NA()","v":{"$error":"#N/A"}},{"$f":"NA()","v":{"$error":"#N/A"}},{"$f":"NA()","v":{"$error":"#N/A"}},10.5,20,null,"BOT",8,8,{"$f":"NA()","v":{"$error":"#N/A"}},{"$f":"NA()","v":{"$error":"#N/A"}},{"$f":"NA()","v":{"$error":"#N/A"}},{"$f":"NA()","v":{"$error":"#N/A"}},{"$f":"NA()","v":{"$error":"#N/A"}},10.5,20,null,"BOT",6,4,{"$f":"NA()","v":{"$error":"#N/A"}},{"$f":"NA()","v":{"$error":"#N/A"}},{"$f":"NA()","v":{"$error":"#N/A"}},{"$f":"NA()","v":{"$error":"#N/A"}},{"$f":"NA()","v":{"$error":"#N/A"}},10.5,23,null,"BOT",15,4,{"$error":"#N/A"},{"$error":"#N/A"},{"$error":"#N/A"},{"$error":"#N/A"},{"$error":"#N/A"},10.5,19,null,"BOT",15,4,{"$error":"#N/A"},{"$error":"#N/A"},{"$error":"#N/A"},{"$error":"#N/A"},{"$error":"#N/A"},10.5,19]
["GHA",15,3,{"$error":"#N/A"},{"$error":"#N/A"},{"$error":"#N/A"},{"$error":"#N/A"},{"$error":"#N/A"},10.5,22,null,null,null,null,"Azerbaijan","AZE","Europe",null,null,null,null,"GHA",15,3,{"$f":"NA()","v":{"$error":"#N/A"}},{"$f":"NA()","v":{"$error":"#N/A"}},{"$f":"NA()","v":{"$error":"#N/A"}},{"$f":"NA()","v":{"$error":"#N/A"}},{"$f":"NA()","v":{"$error":"#N/A"}},10.5,22,null,"GHA",9,6,{"$f":"NA()","v":{"$error":"#N/A"}},{"$f":"NA()","v":{"$error":"#N/A"}},{"$f":"NA()","v":{"$error":"#N/A"}},{"$f":"NA()","v":{"$error":"#N/A"}},{"$f":"NA()","v":{"$error":"#N/A"}},10.5,23,null,"GHA",14,8,{"$f":"NA()","v":{"$error":"#N/A"}},{"$f":"NA()","v":{"$error":"#N/A"}},{"$f":"NA()","v":{"$error":"#N/A"}},{"$f":"NA()","v":{"$error":"#N/A"}},{"$f":"NA()","v":{"$error":"#N/A"}},10.5,22,null,"GHA",15,6,{"$f":"NA()","v":{"$error":"#N/A"}},{"$f":"NA()","v":{"$error":"#N/A"}},{"$f":"NA()","v":{"$error":"#N/A"}},{"$f":"NA()","v":{"$error":"#N/A"}},{"$f":"NA()","v":{"$error":"#N/A"}},10.5,23,null,"GHA",5,7,{"$f":"NA()","v":{"$error":"#N/A"}},{"$f":"NA()","v":{"$error":"#N/A"}},{"$f":"NA()","v":{"$error":"#N/A"}},{"$f":"NA()","v":{"$error":"#N/A"}},{"$f":"NA()","v":{"$error":"#N/A"}},10.5,25,null,"GHA",15,3,{"$error":"#N/A"},{"$error":"#N/A"},{"$error":"#N/A"},{"$error":"#N/A"},{"$error":"#N/A"},10.5,22,null,"GHA",15,3,{"$error":"#N/A"},{"$error":"#N/A"},{"$error":"#N/A"},{"$error":"#N/A"},{"$error":"#N/A"},10.5,22]
["STP",14,8,{"$error":"#N/A"},{"$error":"#N/A"},{"$error":"#N/A"},{"$error":"#N/A"},{"$error":"#N/A"},10.5,24,null,null,null,null,"Bangladesh","BAN","Asia",null,null,null,null,"STP",14,8,{"$f":"NA()","v":{"$error":"#N/A"}},{"$f":"NA()","v":{"$error":"#N/A"}},{"$f":"NA()","v":{"$error":"#N/A"}},{"$f":"NA()","v":{"$error":"#N/A"}},{"$f":"NA()","v":{"$error":"#N/A"}},10.5,24,null,"STP",9,1,{"$f":"NA()","v":{"$error":"#N/A"}},{"$f":"NA()","v":{"$error":"#N/A"}},{"$f":"NA()","v":{"$error":"#N/A"}},{"$f":"NA()","v":{"$error":"#N/A"}},{"$f":"NA()","v":{"$error":"#N/A"}},10.5,25,null,"STP",19,5,{"$f":"NA()","v":{"$error":"#N/A"}},{"$f":"NA()","v":{"$error":"#N/A"}},{"$f":"NA()","v":{"$error":"#N/A"}},{"$f":"NA()","v":{"$error":"#N/A"}},{"$f":"NA()","v":{"$error":"#N/A"}},10.5,24,null,"STP",9,6,{"$f":"NA()","v":{"$error":"#N/A"}},{"$f":"NA()","v":{"$error":"#N/A"}},{"$f":"NA()","v":{"$error":"#N/A"}},{"$f":"NA()","v":{"$error":"#N/A"}},{"$f":"NA()","v":{"$error":"#N/A"}},10.5,25,null,"STP",6,1,{"$f":"NA()","v":{"$error":"#N/A"}},{"$f":"NA()","v":{"$error":"#N/A"}},{"$f":"NA()","v":{"$error":"#N/A"}},{"$f":"NA()","v":{"$error":"#N/A"}},{"$f":"NA()","v":{"$error":"#N/A"}},10.5,27,null,"STP",14,8,{"$error":"#N/A"},{"$error":"#N/A"},{"$error":"#N/A"},{"$error":"#N/A"},{"$error":"#N/A"},10.5,24,null,"STP",14,8,{"$error":"#N/A"},{"$error":"#N/A"},{"$error":"#N/A"},{"$error":"#N/A"},{"$error":"#N/A"},10.5,24]
["GAB",14,7,{"$error":"#N/A"},{"$error":"#N/A"},{"$error":"#N/A"},{"$error":"#N/A"},{"$error":"#N/A"},10.5,26,null,null,null,null,"Belarus","BLR","Europe",null,null,null,null,"GAB",14,7,{"$f":"NA()","v":{"$error":"#N/A"}},{"$f":"NA()","v":{"$error":"#N/A"}},{"$f":"NA()","v":{"$error":"#N/A"}},{"$f":"NA()","v":{"$error":"#N/A"}},{"$f":"NA()","v":{"$error":"#N/A"}},10.5,26,null,"GAB",10,3,{"$f":"NA()","v":{"$error":"#N/A"}},{"$f":"NA()","v":{"$error":"#N/A"}},{"$f":"NA()","v":{"$error":"#N/A"}},{"$f":"NA()","v":{"$error":"#N/A"}},{"$f":"NA()","v":{"$error":"#N/A"}},10.5,27,null,"GAB",16,7,{"$f":"NA()","v":{"$error":"#N/A"}},{"$f":"NA()","v":{"$error":"#N/A"}},{"$f":"NA()","v":{"$error":"#N/A"}},{"$f":"NA()","v":{"$error":"#N/A"}},{"$f":"NA()","v":{"$error":"#N/A"}},10.5,26,null,"GAB",12,7,{"$f":"NA()","v":{"$error":"#N/A"}},{"$f":"NA()","v":{"$error":"#N/A"}},{"$f":"NA()","v":{"$error":"#N/A"}},{"$f":"NA()","v":{"$error":"#N/A"}},{"$f":"NA()","v":{"$error":"#N/A"}},10.5,27,null,"GAB",5,1,{"$f":"NA()","v":{"$error":"#N/A"}},{"$f":"NA()","v":{"$error":"#N/A"}},{"$f":"NA()","v":{"$error":"#N/A"}},{"$f":"NA()","v":{"$error":"#N/A"}},{"$f":"NA()","v":{"$error":"#N/A"}},{"$f":"NA()","v":{"$error":"#N/A"}},{"$f":"NA()","v":{"$error":"#N/A"}},null,"GAB",14,7,{"$error":"#N/A"},{"$error":"#N/A"},{"$error":"#N/A"},{"$error":"#N/A"},{"$error":"#N/A"},10.5,26,null,"GAB",14,7,{"$error":"#N/A"},{"$error":"#N/A"},{"$error":"#N/A"},{"$error":"#N/A"},{"$error":"#N/A"},10.5,26]
{"$rows_left_out":117}
{"sheet":"Sheet4","index":3,"n_rows":28,"n_cols":9,"rows_kept":28,"cut":false,"hidden":false,"merged":[]}
[]
[null,"Code",{"$f":"DETAIL_CODE","v":"SUI"}]
[null,"Position",{"$f":"MATCH(C2,Table1[CountryCode],0)","v":77}]
[null,"Region",{"$f":"INDEX(Table1[Region],C3)","v":"Europe"}]
[null,"Rank",{"$f":"INDEX(Table1[EqRank1],C3)","v":2}]
[null,"CountryName",{"$f":"INDEX(Table1[Country],C3)","v":"Switzerland"}]
[null,"Overall",{"$f":"100-INDEX(Table1[Overall],C3)","v":92},null,{"$f":"(B16-B15+1)*(C7/100)","v":19.32}]
[null,"Enough to eat",{"$f":"100-INDEX(Table1[EnoughToEat],C3)","v":100},null,{"$f":"(B19-B18+1)*(C8/100)","v":10}]
[null,"Food affordability",{"$f":"100-INDEX(Table1[Affordability],C3)","v":92},null,{"$f":"(B22-B21+1)*(C9/100)","v":9.2000000000000011}]
[null,"food quality",{"$f":"100-INDEX(Table1[FoodQuality],C3)","v":99},null,{"$f":"(B25-B24+1)*(C10/100)","v":9.9}]
{"$rows_left_out":19}
{"sheet":"Display","index":4,"n_rows":0,"n_cols":0,"rows_kept":0,"cut":false,"hidden":false,"merged":[]}